Reaction Details
Target5-hydroxytryptamine receptor 2A
LigandBDBM50343263
Substrate/Competitorn/a
Meas. Tech.ChEMBL_745648 (CHEMBL1776018)
Ki 3.2±n/a nM
Citation Johnson, DSChoi, CFay, LKFavor, DARepine, JTWhite, ADAkunne, HCFitzgerald, LNicholls, KSnyder, BJWhetzel, SZZhang, LSerpa, KA Discovery of PF-00217830: aryl piperazine napthyridinones as D2 partial agonists for schizophrenia and bipolar disorder. Bioorg Med Chem Lett21:2621-5 (2011) 
 
5-hydroxytryptamine receptor 2A
Name:5-hydroxytryptamine receptor 2A
Type:undefined
Mol. Mass.:52607.65
Organism:Homo sapiens (Human)
Description:P28223
Residue:471
BDBM50343263
NameBDBM50343263
Synonyms:2-(4-(4-(2,3-dichlorophenyl)piperazin-1-yl)butoxy)pyrido[2,3-d]pyrimidin-7(8H)-one | CHEMBL1774066
TypeSmall organic molecule
Emp. Form.C21H23Cl2N5O2
Mol. Mass.448.346
SMILESClc1cccc(N2CCN(CCCCOc3ncc4ccc(=O)[nH]c4n3)CC2)c1Cl