Reaction Details
Target5-hydroxytryptamine receptor 2A
LigandBDBM50343270
Substrate/Competitorn/a
Meas. Tech.ChEMBL_745648 (CHEMBL1776018)
Ki 10.4±n/a nM
Citation Johnson, DSChoi, CFay, LKFavor, DARepine, JTWhite, ADAkunne, HCFitzgerald, LNicholls, KSnyder, BJWhetzel, SZZhang, LSerpa, KA Discovery of PF-00217830: aryl piperazine napthyridinones as D2 partial agonists for schizophrenia and bipolar disorder. Bioorg Med Chem Lett21:2621-5 (2011) 
 
5-hydroxytryptamine receptor 2A
Name:5-hydroxytryptamine receptor 2A
Type:undefined
Mol. Mass.:52607.65
Organism:Homo sapiens (Human)
Description:P28223
Residue:471
BDBM50343270
NameBDBM50343270
Synonyms:7-(4-(4-(3-chloro-2-fluorophenyl)piperazin-1-yl)butoxy)-3,4-dihydro-1,8-naphthyridin-2(1H)-one | CHEMBL1774073
TypeSmall organic molecule
Emp. Form.C22H26ClFN4O2
Mol. Mass.432.919
SMILESFc1c(Cl)cccc1N1CCN(CCCCOc2ccc3CCC(=O)Nc3n2)CC1