Reaction Details
Target5-hydroxytryptamine receptor 2A
LigandBDBM50343271
Substrate/Competitorn/a
Meas. Tech.ChEMBL_745648 (CHEMBL1776018)
Ki 12±n/a nM
Citation Johnson, DSChoi, CFay, LKFavor, DARepine, JTWhite, ADAkunne, HCFitzgerald, LNicholls, KSnyder, BJWhetzel, SZZhang, LSerpa, KA Discovery of PF-00217830: aryl piperazine napthyridinones as D2 partial agonists for schizophrenia and bipolar disorder. Bioorg Med Chem Lett21:2621-5 (2011) 
 
5-hydroxytryptamine receptor 2A
Name:5-hydroxytryptamine receptor 2A
Type:undefined
Mol. Mass.:52607.65
Organism:Homo sapiens (Human)
Description:P28223
Residue:471
BDBM50343271
NameBDBM50343271
Synonyms:7-(4-(4-(2-chloro-3-(trifluoromethyl)phenyl)piperazin-1-yl)butoxy)-3,4-dihydro-1,8-naphthyridin-2(1H)-one | CHEMBL1774074
TypeSmall organic molecule
Emp. Form.C23H26ClF3N4O2
Mol. Mass.482.926
SMILESFC(F)(F)c1cccc(N2CCN(CCCCOc3ccc4CCC(=O)Nc4n3)CC2)c1Cl