Reaction Details
Target5-hydroxytryptamine receptor 1A
LigandBDBM50343267
Substrate/Competitorn/a
Meas. Tech.ChEMBL_745649 (CHEMBL1776019)
Ki 3.9±n/a nM
Citation Johnson, DSChoi, CFay, LKFavor, DARepine, JTWhite, ADAkunne, HCFitzgerald, LNicholls, KSnyder, BJWhetzel, SZZhang, LSerpa, KA Discovery of PF-00217830: aryl piperazine napthyridinones as D2 partial agonists for schizophrenia and bipolar disorder. Bioorg Med Chem Lett21:2621-5 (2011) 
 
5-hydroxytryptamine receptor 1A
Name:5-hydroxytryptamine receptor 1A
Type:n/a
Mol. Mass.:46122.49
Organism:Homo sapiens (Human)
Description:n/a
Residue:422
BDBM50343267
NameBDBM50343267
Synonyms:7-(4-(4-o-tolylpiperazin-1-yl)butoxy)-3,4-dihydro-1,8-naphthyridin-2(1H)-one | CHEMBL1774070
TypeSmall organic molecule
Emp. Form.C23H30N4O2
Mol. Mass.394.5099
SMILESCc1ccccc1N1CCN(CCCCOc2ccc3CCC(=O)Nc3n2)CC1