Reaction Details
Target5-hydroxytryptamine receptor 1A
LigandBDBM50343268
Substrate/Competitorn/a
Meas. Tech.ChEMBL_745649 (CHEMBL1776019)
Ki 8.5±n/a nM
Citation Johnson, DSChoi, CFay, LKFavor, DARepine, JTWhite, ADAkunne, HCFitzgerald, LNicholls, KSnyder, BJWhetzel, SZZhang, LSerpa, KA Discovery of PF-00217830: aryl piperazine napthyridinones as D2 partial agonists for schizophrenia and bipolar disorder. Bioorg Med Chem Lett21:2621-5 (2011) 
 
5-hydroxytryptamine receptor 1A
Name:5-hydroxytryptamine receptor 1A
Type:n/a
Mol. Mass.:46122.49
Organism:Homo sapiens (Human)
Description:n/a
Residue:422
BDBM50343268
NameBDBM50343268
Synonyms:7-(4-(4-(2,3-dimethylphenyl)piperazin-1-yl)butoxy)-3,4-dihydro-1,8-naphthyridin-2(1H)-one | CHEMBL1774071
TypeSmall organic molecule
Emp. Form.C24H32N4O2
Mol. Mass.408.5365
SMILESCc1cccc(N2CCN(CCCCOc3ccc4CCC(=O)Nc4n3)CC2)c1C