Reaction Details
TargetAlbumin
LigandBDBM50343352
Substrate/Competitorn/a
Meas. Tech.ChEMBL_746838 (CHEMBL1777121)
Kd 9.5E4±n/a nM
Citation Giannetti, AMWong, HDijkgraaf, GJDueber, ECOrtwine, DFBravo, BJGould, SEPlise, EGLum, BLMalhi, VGraham, RA Identification, characterization, and implications of species-dependent plasma protein binding for the oral Hedgehog pathway inhibitor vismodegib (GDC-0449). J Med Chem54:2592-601 (2011) 
 
Albumin
Name:Albumin
Type:PROTEIN
Mol. Mass.:68729.59
Organism:Rattus norvegicus
Description:ChEMBL_1486769
Residue:608
BDBM50343352
NameBDBM50343352
Synonyms:2-hydroxy-3-(3-oxo-1-phenylbutyl)-4H-chromen-4-one 4-Hydroxy-3-(3-oxo-1-phenyl-butyl)-chromen-2-one CHEMBL1464 Jantoven wafarin warfarine
TypeSmall organic molecule
Emp. Form.C19H16O4
Mol. Mass.308.3279
SMILESCC(=O)CC(c1ccccc1)c1c(O)c2ccccc2oc1=O