Reaction Details
TargetGlucose-dependent insulinotropic receptor
LigandBDBM50343442
Substrate/Competitorn/a
Meas. Tech.ChEMBL_746178 (CHEMBL1775792)
EC50 23±n/a nM
Citation Semple, GRen, AFioravanti, BPereira, GCalderon, IChoi, KXiong, YShin, YJGharbaoui, TSage, CRMorgan, MXing, CChu, ZLLeonard, JNGrottick, AJAl-Shamma, HLiang, YDemarest, KTJones, RM Discovery of fused bicyclic agonists of the orphan G-protein coupled receptor GPR119 with in vivo activity in rodent models of glucose control. Bioorg Med Chem Lett21:3134-41 (2011) 
 
Glucose-dependent insulinotropic receptor
Name:Glucose-dependent insulinotropic receptor
Type:Protein
Mol. Mass.:36901.49
Organism:Homo sapiens (Human)
Description:Q8TDV5
Residue:335
BDBM50343442
NameBDBM50343442
Synonyms:CHEMBL1775179 | isopropyl 4-(1-(2-fluoro-4-(methylsulfonyl)phenyl)-1H-pyrazolo[3,4-d]pyrimidin-4-yloxy)piperidine-1-carboxylate
TypeSmall organic molecule
Emp. Form.C21H24FN5O5S
Mol. Mass.477.509
SMILESCC(C)OC(=O)N1CCC(CC1)Oc1ncnc2n(ncc12)-c1ccc(cc1F)S(C)(=O)=O