Reaction Details
TargetProto-oncogene tyrosine-protein kinase ROS
LigandBDBM50343559
Substrate/Competitorn/a
Meas. Tech.ChEMBL_745939 (CHEMBL1776309)
IC50>10000±n/a nM
Citation Beria, IBossi, RTBrasca, MGCaruso, MCeccarelli, WFachin, GFasolini, MForte, BFiorentini, FPesenti, EPezzetta, DPosteri, HScolaro, ARe Depaolini, SValsasina, B NMS-P937, a 4,5-dihydro-1H-pyrazolo[4,3-h]quinazoline derivative as potent and selective Polo-like kinase 1 inhibitor. Bioorg Med Chem Lett21:2969-74 (2011) 
 
Proto-oncogene tyrosine-protein kinase ROS
Name:Proto-oncogene tyrosine-protein kinase ROS
Type:Enzyme
Mol. Mass.:263897.39
Organism:Homo sapiens (Human)
Description:P08922
Residue:2347
BDBM50343559
NameBDBM50343559
Synonyms:1-(2-HYDROXYETHYL)-8-[[5-(4-METHYLPIPERAZIN-1-YL)-2-(TRIFLUOROMETHOXY)PHENYL]AMINO]-4,5-DIHYDROPYRIMIDO[5,4-G]INDAZOLE-3-CARBOXAMIDE CHEMBL1738758
TypeSmall organic molecule
Emp. Form.C24H27F3N8O3
Mol. Mass.532.5182
SMILESCN1CCN(CC1)c1ccc(OC(F)(F)F)c(Nc2ncc3CCc4c(nn(CCO)c4-c3n2)C(N)=O)c1