Reaction Details
TargetSerine/threonine-protein kinase PLK2
LigandBDBM50329935
Substrate/Competitorn/a
Meas. Tech.ChEMBL_747146 (CHEMBL1777512)
IC50 429±n/a nM
Citation Beria, IBossi, RTBrasca, MGCaruso, MCeccarelli, WFachin, GFasolini, MForte, BFiorentini, FPesenti, EPezzetta, DPosteri, HScolaro, ARe Depaolini, SValsasina, B NMS-P937, a 4,5-dihydro-1H-pyrazolo[4,3-h]quinazoline derivative as potent and selective Polo-like kinase 1 inhibitor. Bioorg Med Chem Lett21:2969-74 (2011) 
 
Serine/threonine-protein kinase PLK2
Name:Serine/threonine-protein kinase PLK2
Type:Serine/threonine-protein kinase
Mol. Mass.:78259.87
Organism:Homo sapiens (Human)
Description:Full-length human PLK2 was expressed as GST-fusion protein using baculovirus expression system. GST-PLK2 was purified by using glutathione sepharose chromatography.
Residue:685
BDBM50329935
NameBDBM50329935
Synonyms:1-methyl-8-(5-(2-(1-methylpyrrolidin-2-yl)ethylamino)-2-(trifluoromethoxy)phenylamino)-4,5-dihydro-1H-pyrazolo[4,3-h]quinazoline-3-carboxamide | CHEMBL1271535
TypeSmall organic molecule
Emp. Form.C25H29F3N8O2
Mol. Mass.530.5454
SMILESCN1CCCC1CCNc1ccc(OC(F)(F)F)c(Nc2ncc3CCc4c(nn(C)c4-c3n2)C(N)=O)c1