Reaction Details
TargetSerine/threonine-protein kinase PLK3
LigandBDBM50343568
Substrate/Competitorn/a
Meas. Tech.ChEMBL_747147 (CHEMBL1777513)
IC50 323±n/a nM
Citation Beria, IBossi, RTBrasca, MGCaruso, MCeccarelli, WFachin, GFasolini, MForte, BFiorentini, FPesenti, EPezzetta, DPosteri, HScolaro, ARe Depaolini, SValsasina, B NMS-P937, a 4,5-dihydro-1H-pyrazolo[4,3-h]quinazoline derivative as potent and selective Polo-like kinase 1 inhibitor. Bioorg Med Chem Lett21:2969-74 (2011) 
 
Serine/threonine-protein kinase PLK3
Name:Serine/threonine-protein kinase PLK3
Type:Serine/threonine-protein kinase
Mol. Mass.:71655.17
Organism:Homo sapiens (Human)
Description:Enzyme assays were using PLK3 purified from baculovirus-infected Trichoplusia ni cells expressing full-length PLK3.
Residue:646
BDBM50343568
NameBDBM50343568
Synonyms:1-methyl-8-(5-(1-methyl-1,2,3,6-tetrahydropyridin-4-yl)-2-(trifluoromethoxy)phenylamino)-4,5-dihydro-1H-pyrazolo[4,3-h]quinazoline-3-carboxamide | CHEMBL1774327
TypeSmall organic molecule
Emp. Form.C24H24F3N7O2
Mol. Mass.499.4883
SMILESCN1CCC(=CC1)c1ccc(OC(F)(F)F)c(Nc2ncc3CCc4c(nn(C)c4-c3n2)C(N)=O)c1