Reaction Details
TargetSerine/threonine-protein kinase PLK3
LigandBDBM50343565
Substrate/Competitorn/a
Meas. Tech.ChEMBL_747147 (CHEMBL1777513)
IC50 239±n/a nM
Citation Beria, IBossi, RTBrasca, MGCaruso, MCeccarelli, WFachin, GFasolini, MForte, BFiorentini, FPesenti, EPezzetta, DPosteri, HScolaro, ARe Depaolini, SValsasina, B NMS-P937, a 4,5-dihydro-1H-pyrazolo[4,3-h]quinazoline derivative as potent and selective Polo-like kinase 1 inhibitor. Bioorg Med Chem Lett21:2969-74 (2011) 
 
Serine/threonine-protein kinase PLK3
Name:Serine/threonine-protein kinase PLK3
Type:Serine/threonine-protein kinase
Mol. Mass.:71655.17
Organism:Homo sapiens (Human)
Description:Enzyme assays were using PLK3 purified from baculovirus-infected Trichoplusia ni cells expressing full-length PLK3.
Residue:646
BDBM50343565
NameBDBM50343565
Synonyms:1-methyl-8-(5-(pyrrolidin-2-ylamino)-2-(trifluoromethoxy)phenylamino)-4,5-dihydro-1H-pyrazolo[4,3-h]quinazoline-3-carboxamide | CHEMBL1774332
TypeSmall organic molecule
Emp. Form.C22H23F3N8O2
Mol. Mass.488.4656
SMILESCn1nc(C(N)=O)c2CCc3cnc(Nc4cc(NC5CCCN5)ccc4OC(F)(F)F)nc3-c12