Reaction Details
TargetMelanocyte-stimulating hormone receptor
LigandBDBM50343650
Substrate/Competitorn/a
Meas. Tech.ChEMBL_747178 (CHEMBL1777641)
IC50>1000±n/a nM
Citation Mayorov, AVCai, MPalmer, ESTanaka, DKCain, JPDedek, MMTan, BTrivedi, DHruby, VJ Cyclic lactam hybrida-MSH/Agouti-related protein (AGRP) analogues with nanomolar range binding affinities at the human melanocortin receptors. Bioorg Med Chem Lett21:3099-102 (2011) 
 
Melanocyte-stimulating hormone receptor
Name:Melanocyte-stimulating hormone receptor
Type:Enzyme
Mol. Mass.:34717.23
Organism:Homo sapiens (Human)
Description:Q01726
Residue:317
BDBM50343650
NameBDBM50343650
Synonyms:(2S,5S,8R,11S,14S,17S,20S)-5-((1H-indol-3-yl)methyl)-8,17-dibenzyl-2,11-bis(3-guanidinopropyl)-14-methyl-3,6,9,12,15,18,23-heptaoxo-1,4,7,10,13,16,19-heptaazacyclotricosane-20-carboxamide | CHEMBL1775066
TypeSmall organic molecule
Emp. Form.C49H65N15O8
Mol. Mass.992.1361
SMILESC[C@@H]1NC(=O)[C@H](CCCN=C(N)N)NC(=O)[C@@H](Cc2ccccc2)NC(=O)[C@H](Cc2c[nH]c3ccccc23)NC(=O)[C@H](CCCN=C(N)N)NC(=O)CC[C@H](NC(=O)[C@H](Cc2ccccc2)NC1=O)C(N)=O