Reaction Details
TargetRibosomal protein S6 kinase alpha-3
LigandBDBM50343665
Substrate/Competitorn/a
Meas. Tech.ChEMBL_747182 (CHEMBL1777645)
IC50 15140±n/a nM
Citation Lu, WLiu, XCao, XXue, MLiu, KZhao, ZShen, XJiang, HXu, YHuang, JLi, H SHAFTS: a hybrid approach for 3D molecular similarity calculation. 2. Prospective case study in the discovery of diverse p90 ribosomal S6 protein kinase 2 inhibitors to suppress cell migration. J Med Chem54:3564-74 (2011) 
 
Ribosomal protein S6 kinase alpha-3
Name:Ribosomal protein S6 kinase alpha-3
Type:Serine/threonine-protein kinase
Mol. Mass.:83740.03
Organism:Homo sapiens (Human)
Description:The human RSK2 sequence differed from the Genbank entry NM_004586 at one residue, V45G. The protein was cloned and purified from baculovirus expression system.
Residue:740
BDBM50343665
NameBDBM50343665
Synonyms:4-((4-hydroxy-2,3-dimethylphenyl)diazenyl)benzenesulfonic acid | CHEMBL1775080
TypeSmall organic molecule
Emp. Form.C14H14N2O4S
Mol. Mass.306.337
SMILESCc1c(C)c(ccc1O)N=Nc1ccc(cc1)S(O)(=O)=O