Reaction Details
TargetPotassium voltage-gated channel subfamily E member 1
LigandBDBM50343721
Substrate/Competitorn/a
Meas. Tech.ChEMBL_746072 (CHEMBL1775459)
IC50>9000±n/a nM
Citation Wang, LHubert, JALee, SJPan, JQian, SReitman, MLStrack, AMWeingarth, DTMacNeil, DJWeber, AEEdmondson, SD Discovery of pyrimidine carboxamides as potent and selective CCK1 receptor agonists. Bioorg Med Chem Lett21:2911-5 (2011) 
 
Potassium voltage-gated channel subfamily E member 1
Name:Potassium voltage-gated channel subfamily E member 1
Type:PROTEIN
Mol. Mass.:14676.11
Organism:Homo sapiens (Human)
Description:ChEMBL_1456351
Residue:129
BDBM50343721
NameBDBM50343721
Synonyms:3-(4-(4-(2-fluoro-4-methylphenyl)-5-(4-methoxyphenyl)pyrimidine-2-carbonyl)piperazin-1-yl)-1-naphthoic acid | CHEMBL1774043
TypeSmall organic molecule
Emp. Form.C34H29FN4O4
Mol. Mass.576.6169
SMILESCOc1ccc(cc1)-c1cnc(nc1-c1ccc(C)cc1F)C(=O)N1CCN(CC1)c1cc(C(O)=O)c2ccccc2c1