Reaction Details
TargetProstaglandin G/H synthase 2
LigandBDBM50056999
Substrate/Competitorn/a
Meas. Tech.ChEMBL_747536 (CHEMBL1777070)
IC50 23±n/a nM
Citation Chen, ZWu, YLiu, YYang, SChen, YLai, L Discovery of dual target inhibitors against cyclooxygenases and leukotriene A4 hydrolyase. J Med Chem54:3650-60 (2011) 
 
Prostaglandin G/H synthase 2
Name:Prostaglandin G/H synthase 2
Type:Enzyme
Mol. Mass.:69003.89
Organism:Homo sapiens (Human)
Description:Recombinant Cox-2 provided by Cayman (Cayman Chemical Co.,Ann Arbor, MI).
Residue:604
BDBM50056999
NameBDBM50056999
Synonyms:CHEMBL56367 | nimesulide
TypeSmall organic molecule
Emp. Form.C13H12N2O5S
Mol. Mass.308.31
SMILESCS(=O)(=O)Nc1ccc(cc1Oc1ccccc1)[N+]([O-])=O