Reaction Details
TargetHigh affinity cAMP-specific and IBMX-insensitive 3',5'-cyclic phosphodiesterase 8B
LigandBDBM50344024
Substrate/Competitorn/a
Meas. Tech.ChEMBL_748479 (CHEMBL1780332)
IC50 4.3±n/a nM
Citation DeNinno, MPWright, SWVisser, MSEtienne, JBMoore, DEOlson, TVRocke, BNAndrews, MPZarbo, CMillham, MLBoscoe, BPBoyer, DDDoran, SDHouseknecht, KL 1,5-Substituted nipecotic amides: selective PDE8 inhibitors displaying diastereomer-dependent microsomal stability. Bioorg Med Chem Lett21:3095-8 (2011) 
 
High affinity cAMP-specific and IBMX-insensitive 3',5'-cyclic phosphodiesterase 8B
Name:High affinity cAMP-specific and IBMX-insensitive 3',5'-cyclic phosphodiesterase 8B
Type:PROTEIN
Mol. Mass.:98984.88
Organism:Homo sapiens (Human)
Description:ChEMBL_876321
Residue:885
BDBM50344024
NameBDBM50344024
Synonyms:CHEMBL1780097 | trans-(3S,5S)-5-(methoxymethyl)-1-((5-methyl-2-phenyloxazol-4-yl)methyl)-N-((6-methylpyridin-2-yl)methyl)piperidine-3-carboxamide
TypeSmall organic molecule
Emp. Form.C26H32N4O3
Mol. Mass.448.5573
SMILESCOC[C@H]1C[C@@H](CN(Cc2nc(oc2C)-c2ccccc2)C1)C(=O)NCc1cccc(C)n1