Reaction Details
TargetB1 bradykinin receptor
LigandBDBM50344103
Substrate/Competitorn/a
Meas. Tech.ChEMBL_748611 (CHEMBL1780464)
Ki 541±n/a nM
Citation Chen, JJNguyen, TD'Amico, DCQian, WHuman, JAya, TBiswas, KFotsch, CHan, NLiu, QNishimura, NPeterkin, TAYang, KZhu, JRiahi, BBHungate, RWAndersen, NGColyer, JTFaul, MMKamassah, AWang, JJona, JKumar, GJohnson, EAskew, BC 3-Oxo-2-piperazinyl acetamides as potent bradykinin B1 receptor antagonists for the treatment of pain and inflammation. Bioorg Med Chem Lett21:3384-9 (2011) 
 
B1 bradykinin receptor
Name:B1 bradykinin receptor
Type:Enzyme
Mol. Mass.:40508.87
Organism:Homo sapiens (Human)
Description:P46663
Residue:353
BDBM50344103
NameBDBM50344103
Synonyms:2-((S)-3-oxo-1-tosylpiperazin-2-yl)-N-((S)-6-(piperidin-1-ylmethyl)-1,2,3,4-tetrahydronaphthalen-1-yl)acetamide | CHEMBL1777961
TypeSmall organic molecule
Emp. Form.C29H38N4O4S
Mol. Mass.538.701
SMILESCc1ccc(cc1)S(=O)(=O)N1CCNC(=O)[C@@H]1CC(=O)N[C@H]1CCCc2cc(CN3CCCCC3)ccc12