Reaction Details
TargetB1 bradykinin receptor
LigandBDBM50344117
Substrate/Competitorn/a
Meas. Tech.ChEMBL_748609 (CHEMBL1780462)
IC50 0.6±n/a nM
Citation Chen, JJNguyen, TD'Amico, DCQian, WHuman, JAya, TBiswas, KFotsch, CHan, NLiu, QNishimura, NPeterkin, TAYang, KZhu, JRiahi, BBHungate, RWAndersen, NGColyer, JTFaul, MMKamassah, AWang, JJona, JKumar, GJohnson, EAskew, BC 3-Oxo-2-piperazinyl acetamides as potent bradykinin B1 receptor antagonists for the treatment of pain and inflammation. Bioorg Med Chem Lett21:3384-9 (2011) 
 
B1 bradykinin receptor
Name:B1 bradykinin receptor
Type:Enzyme
Mol. Mass.:40508.87
Organism:Homo sapiens (Human)
Description:P46663
Residue:353
BDBM50344117
NameBDBM50344117
Synonyms:CHEMBL1777975 | N-((R)-6-((cyclopentylamino)methyl)-1,2,3,4-tetrahydronaphthalen-1-yl)-2-((R)-3-oxo-1-tosylpiperazin-2-yl)acetamide
TypeSmall organic molecule
Emp. Form.C29H38N4O4S
Mol. Mass.538.701
SMILESCc1ccc(cc1)S(=O)(=O)N1CCNC(=O)[C@H]1CC(=O)N[C@@H]1CCCc2cc(CNC3CCCC3)ccc12