Reaction Details
TargetMitogen-activated protein kinase 14
LigandBDBM50344123
Substrate/Competitorn/a
Meas. Tech.ChEMBL_747874 (CHEMBL1781129)
Kd 1±n/a nM
Citation Soth, MAbbot, SAbubakari, AArora, NArzeno, HBilledeau, RDewdney, NDurkin, KFrauchiger, SGhate, MGoldstein, DMHill, RJKuglstatter, ALi, FLoe, BMcCaleb, KMcIntosh, JPapp, EPark, JStahl, MSung, MLSuttman, RSwinney, DCWeller, PWong, BZecic, HGabriel, T 3-Amino-pyrazolo[3,4-d]pyrimidines as p38a kinase inhibitors: design and development to a highly selective lead. Bioorg Med Chem Lett21:3452-6 (2011) 
 
Mitogen-activated protein kinase 14
Name:Mitogen-activated protein kinase 14
Type:Serine/threonine-protein kinase
Mol. Mass.:41286.76
Organism:Homo sapiens (Human)
Description:Q16539
Residue:360
BDBM50344123
NameBDBM50344123
Synonyms:(R)-6-(2,4-difluorophenoxy)-N-(1-(methylsulfonyl)propan-2-yl)-1H-pyrazolo[3,4-d]pyrimidin-3-amine CHEMBL1236810
TypeSmall organic molecule
Emp. Form.C15H15F2N5O3S
Mol. Mass.383.373
SMILESC[C@H](CS(C)(=O)=O)Nc1[nH]nc2nc(Oc3ccc(F)cc3F)ncc12