Reaction Details
TargetProstaglandin D2 receptor 2
LigandBDBM50344182
Substrate/Competitorn/a
Meas. Tech.ChEMBL_748139 (CHEMBL1781769)
Ki 1220±n/a nM
Citation Zaghdane, HBoyd, MColucci, JSimard, DBerthelette, CLeblanc, YWang, ZHoule, RLévesque, JFMolinaro, CHamel, MStocco, RSawyer, NSillaots, SGervais, FGallant, M New indole amide derivatives as potent CRTH2 receptor antagonists. Bioorg Med Chem Lett21:3471-4 (2011) 
 
Prostaglandin D2 receptor 2
Name:Prostaglandin D2 receptor 2
Type:Enzyme
Mol. Mass.:43295.45
Organism:Homo sapiens (Human)
Description:Q9Y5Y4
Residue:395
BDBM50344182
NameBDBM50344182
Synonyms:(R)-2-(7-(2-(4-(dimethylamino)phenyl)-N-methylacetamido)-6,7,8,9-tetrahydropyrido[1,2-a]indol-10-yl)acetic acid | CHEMBL1778520
TypeSmall organic molecule
Emp. Form.C25H29N3O3
Mol. Mass.419.5161
SMILESCN(C)c1ccc(CC(=O)N(C)[C@@H]2CCc3c(CC(O)=O)c4ccccc4n3C2)cc1