Reaction Details
TargetProstaglandin D2 receptor 2
LigandBDBM50344175
Substrate/Competitorn/a
Meas. Tech.ChEMBL_748139 (CHEMBL1781769)
Ki 70±n/a nM
Citation Zaghdane, HBoyd, MColucci, JSimard, DBerthelette, CLeblanc, YWang, ZHoule, RLévesque, JFMolinaro, CHamel, MStocco, RSawyer, NSillaots, SGervais, FGallant, M New indole amide derivatives as potent CRTH2 receptor antagonists. Bioorg Med Chem Lett21:3471-4 (2011) 
 
Prostaglandin D2 receptor 2
Name:Prostaglandin D2 receptor 2
Type:Enzyme
Mol. Mass.:43295.45
Organism:Homo sapiens (Human)
Description:Q9Y5Y4
Residue:395
BDBM50344175
NameBDBM50344175
Synonyms:(R)-2-(7-(2-(2,4-difluorophenyl)-N-methylacetamido)-6,7,8,9-tetrahydropyrido[1,2-a]indol-10-yl)acetic acid | CHEMBL1778513
TypeSmall organic molecule
Emp. Form.C23H22F2N2O3
Mol. Mass.412.4292
SMILESCN([C@@H]1CCc2c(CC(O)=O)c3ccccc3n2C1)C(=O)Cc1ccc(F)cc1F