Reaction Details
TargetProstaglandin D2 receptor 2
LigandBDBM50344169
Substrate/Competitorn/a
Meas. Tech.ChEMBL_748140 (CHEMBL1781819)
IC50 810±n/a nM
Citation Zaghdane, HBoyd, MColucci, JSimard, DBerthelette, CLeblanc, YWang, ZHoule, RLévesque, JFMolinaro, CHamel, MStocco, RSawyer, NSillaots, SGervais, FGallant, M New indole amide derivatives as potent CRTH2 receptor antagonists. Bioorg Med Chem Lett21:3471-4 (2011) 
 
Prostaglandin D2 receptor 2
Name:Prostaglandin D2 receptor 2
Type:Enzyme
Mol. Mass.:43295.45
Organism:Homo sapiens (Human)
Description:Q9Y5Y4
Residue:395
BDBM50344169
NameBDBM50344169
Synonyms:2-((7R)-7-(N-methyl-2,3-dihydro-1H-indene-1-carboxamido)-6,7,8,9-tetrahydropyrido[1,2-a]indol-10-yl)acetic acid | CHEMBL1778507
TypeSmall organic molecule
Emp. Form.C25H26N2O3
Mol. Mass.402.4855
SMILESCN([C@@H]1CCc2c(CC(O)=O)c3ccccc3n2C1)C(=O)C1CCc2ccccc12