Reaction Details
TargetGlutamate receptor ionotropic, NMDA 2B
LigandBDBM50344234
Substrate/Competitorn/a
Meas. Tech.ChEMBL_748229 (CHEMBL1781192)
Ki 54±n/a nM
Citation Brown, DGMaier, DLSylvester, MAHoerter, TNMenhaji-Klotz, ELasota, CCHirata, LTWilkins, DEScott, CWTrivedi, SChen, TMcCarthy, DJMaciag, CMSutton, EJCumberledge, JMathisen, DRoberts, JGupta, ALiu, FElmore, CSAlhambra, CKrumrine, JRWang, XCiaccio, PJWood, MWCampbell, JBJohansson, MJXia, JWen, XJiang, JWang, XPeng, ZHu, TWang, J 2,6-Disubstituted pyrazines and related analogs as NR2B site antagonists of the NMDA receptor with anti-depressant activity. Bioorg Med Chem Lett21:3399-403 (2011) 
 
Glutamate receptor ionotropic, NMDA 2B
Name:Glutamate receptor ionotropic, NMDA 2B
Type:Protein
Mol. Mass.:166077.66
Organism:Rattus norvegicus (Rat)
Description:Q00960
Residue:1482
BDBM50344234
NameBDBM50344234
Synonyms:CHEMBL1778867 | N-((6-(4-fluoro-2-methoxyphenyl)pyrazin-2-yl)methyl)cyclopentanamine
TypeSmall organic molecule
Emp. Form.C17H20FN3O
Mol. Mass.301.3586
SMILESCOc1cc(F)ccc1-c1cncc(CNC2CCCC2)n1