Reaction Details
TargetGlutamate receptor ionotropic, NMDA 2B
LigandBDBM50344246
Substrate/Competitorn/a
Meas. Tech.ChEMBL_748229 (CHEMBL1781192)
Ki 1554±n/a nM
Citation Brown, DGMaier, DLSylvester, MAHoerter, TNMenhaji-Klotz, ELasota, CCHirata, LTWilkins, DEScott, CWTrivedi, SChen, TMcCarthy, DJMaciag, CMSutton, EJCumberledge, JMathisen, DRoberts, JGupta, ALiu, FElmore, CSAlhambra, CKrumrine, JRWang, XCiaccio, PJWood, MWCampbell, JBJohansson, MJXia, JWen, XJiang, JWang, XPeng, ZHu, TWang, J 2,6-Disubstituted pyrazines and related analogs as NR2B site antagonists of the NMDA receptor with anti-depressant activity. Bioorg Med Chem Lett21:3399-403 (2011) 
 
Glutamate receptor ionotropic, NMDA 2B
Name:Glutamate receptor ionotropic, NMDA 2B
Type:Protein
Mol. Mass.:166077.66
Organism:Rattus norvegicus (Rat)
Description:Q00960
Residue:1482
BDBM50344246
NameBDBM50344246
Synonyms:3-(6-((cyclopentylamino)methyl)pyrazin-2-yl)benzonitrile | CHEMBL1778999
TypeSmall organic molecule
Emp. Form.C17H18N4
Mol. Mass.278.3516
SMILESN#Cc1cccc(c1)-c1cncc(CNC2CCCC2)n1