Reaction Details
TargetCarbonic anhydrase 1
LigandBDBM50344551
Substrate/Competitorn/a
Meas. Tech.ChEMBL_748113 (CHEMBL1781743)
Ki 189±n/a nM
Citation Mincione, FBenedini, FBiondi, SCecchi, ATemperini, CFormicola, GPacileo, IScozzafava, AMasini, ESupuran, CT Synthesis and crystallographic analysis of new sulfonamides incorporating NO-donating moieties with potent antiglaucoma action. Bioorg Med Chem Lett21:3216-21 (2011) 
 
Carbonic anhydrase 1
Name:Carbonic anhydrase 1
Type:Enzyme
Mol. Mass.:28873.37
Organism:Homo sapiens (Human)
Description:P00915
Residue:261
BDBM50344551
NameBDBM50344551
Synonyms:4-(Nitrooxy)butyl-4-(aminosulfonyl)benzoate | CHEMBL1778431
TypeSmall organic molecule
Emp. Form.C11H14N2O7S
Mol. Mass.318.303
SMILESNS(=O)(=O)c1ccc(cc1)C(=O)OCCCCO[N+]([O-])=O