Reaction Details
TargetCarbonic anhydrase 1
LigandBDBM50344557
Substrate/Competitorn/a
Meas. Tech.ChEMBL_748113 (CHEMBL1781743)
Ki 43±n/a nM
Citation Mincione, FBenedini, FBiondi, SCecchi, ATemperini, CFormicola, GPacileo, IScozzafava, AMasini, ESupuran, CT Synthesis and crystallographic analysis of new sulfonamides incorporating NO-donating moieties with potent antiglaucoma action. Bioorg Med Chem Lett21:3216-21 (2011) 
 
Carbonic anhydrase 1
Name:Carbonic anhydrase 1
Type:Enzyme
Mol. Mass.:28873.37
Organism:Homo sapiens (Human)
Description:P00915
Residue:261
BDBM50344557
NameBDBM50344557
Synonyms:2-methoxy-4-(3-(4-(nitrooxy)butoxy)-3-oxoprop-1-enyl)phenyl 4-(N-(5-sulfamoyl-1,3,4-thiadiazol-2-yl)sulfamoyl)benzoate | CHEMBL1778436
TypeSmall organic molecule
Emp. Form.C23H23N5O12S3
Mol. Mass.657.65
SMILESCOc1cc(\C=C\C(=O)OCCCCO[N+]([O-])=O)ccc1OC(=O)c1ccc(cc1)S(=O)(=O)Nc1nnc(s1)S(N)(=O)=O