Reaction Details
TargetCarbonic anhydrase 1
LigandBDBM50344560
Substrate/Competitorn/a
Meas. Tech.ChEMBL_748113 (CHEMBL1781743)
Ki 41±n/a nM
Citation Mincione, FBenedini, FBiondi, SCecchi, ATemperini, CFormicola, GPacileo, IScozzafava, AMasini, ESupuran, CT Synthesis and crystallographic analysis of new sulfonamides incorporating NO-donating moieties with potent antiglaucoma action. Bioorg Med Chem Lett21:3216-21 (2011) 
 
Carbonic anhydrase 1
Name:Carbonic anhydrase 1
Type:Enzyme
Mol. Mass.:28873.37
Organism:Homo sapiens (Human)
Description:P00915
Residue:261
BDBM50344560
NameBDBM50344560
Synonyms:4-(4-sulfamoylphenoxy)butyl nitrate | CHEMBL1778438
TypeSmall organic molecule
Emp. Form.C10H14N2O6S
Mol. Mass.290.293
SMILESNS(=O)(=O)c1ccc(OCCCCO[N+]([O-])=O)cc1