Reaction Details
TargetCarbonic anhydrase 2
LigandBDBM50344553
Substrate/Competitorn/a
Meas. Tech.ChEMBL_748114 (CHEMBL1781744)
Ki 10±n/a nM
Citation Mincione, FBenedini, FBiondi, SCecchi, ATemperini, CFormicola, GPacileo, IScozzafava, AMasini, ESupuran, CT Synthesis and crystallographic analysis of new sulfonamides incorporating NO-donating moieties with potent antiglaucoma action. Bioorg Med Chem Lett21:3216-21 (2011) 
 
Carbonic anhydrase 2
Name:Carbonic anhydrase 2
Type:Enzyme
Mol. Mass.:29250.71
Organism:Homo sapiens (Human)
Description:P00918
Residue:260
BDBM50344553
NameBDBM50344553
Synonyms:2-methoxy-4-(3-(4-(nitrooxy)butoxy)-3-oxoprop-1-enyl)phenyl-4-sulfamoylbenzoate | CHEMBL1778433
TypeSmall organic molecule
Emp. Form.C21H22N2O10S
Mol. Mass.494.472
SMILESCOc1cc(\C=C\C(=O)OCCCCO[N+]([O-])=O)ccc1OC(=O)c1ccc(cc1)S(N)(=O)=O