Reaction Details
TargetCarbonic anhydrase 4
LigandBDBM50344560
Substrate/Competitorn/a
Meas. Tech.ChEMBL_748115 (CHEMBL1781745)
Ki 76±n/a nM
Citation Mincione, FBenedini, FBiondi, SCecchi, ATemperini, CFormicola, GPacileo, IScozzafava, AMasini, ESupuran, CT Synthesis and crystallographic analysis of new sulfonamides incorporating NO-donating moieties with potent antiglaucoma action. Bioorg Med Chem Lett21:3216-21 (2011) 
 
Carbonic anhydrase 4
Name:Carbonic anhydrase 4
Type:Enzyme
Mol. Mass.:35037.98
Organism:Homo sapiens (Human)
Description:P22748
Residue:312
BDBM50344560
NameBDBM50344560
Synonyms:4-(4-sulfamoylphenoxy)butyl nitrate | CHEMBL1778438
TypeSmall organic molecule
Emp. Form.C10H14N2O6S
Mol. Mass.290.293
SMILESNS(=O)(=O)c1ccc(OCCCCO[N+]([O-])=O)cc1