Reaction Details
TargetCarbonic anhydrase 12
LigandBDBM50344559
Substrate/Competitorn/a
Meas. Tech.ChEMBL_748166 (CHEMBL1781845)
Ki 83±n/a nM
Citation Mincione, FBenedini, FBiondi, SCecchi, ATemperini, CFormicola, GPacileo, IScozzafava, AMasini, ESupuran, CT Synthesis and crystallographic analysis of new sulfonamides incorporating NO-donating moieties with potent antiglaucoma action. Bioorg Med Chem Lett21:3216-21 (2011) 
 
Carbonic anhydrase 12
Name:Carbonic anhydrase 12
Type:Enzyme
Mol. Mass.:39456.00
Organism:Homo sapiens (Human)
Description:Catalytic domain of human cloned isozyme was used in the assay
Residue:354
BDBM50344559
NameBDBM50344559
Synonyms:3-(4-sulfamoylphenoxy)propyl nitrate | CHEMBL1777820
TypeSmall organic molecule
Emp. Form.C9H12N2O6S
Mol. Mass.276.266
SMILESNS(=O)(=O)c1ccc(OCCCO[N+]([O-])=O)cc1