Reaction Details
TargetALK tyrosine kinase receptor
LigandBDBM50344644
Substrate/Competitorn/a
Meas. Tech.ChEMBL_748985 (CHEMBL1781770)
IC50 1340±n/a nM
Citation Kinoshita, KOno, YEmura, TAsoh, KFuruichi, NIto, TKawada, HTanaka, SMorikami, KTsukaguchi, TSakamoto, HTsukuda, TOikawa, N Discovery of novel tetracyclic compounds as anaplastic lymphoma kinase inhibitors. Bioorg Med Chem Lett21:3788-93 (2011) 
 
ALK tyrosine kinase receptor
Name:ALK tyrosine kinase receptor
Type:Protein
Mol. Mass.:176453.10
Organism:Homo sapiens (Human)
Description:Q9UM73
Residue:1620
BDBM50344644
NameBDBM50344644
Synonyms:8-(2-(diethylamino)ethoxy)-3-ethoxy-6,6-dimethylbenzo[d]naphtho[2,3-b]furan-11(6H)-one | CHEMBL1779097
TypeSmall organic molecule
Emp. Form.C26H31NO4
Mol. Mass.421.5286
SMILESCCOc1ccc2c3c(oc2c1)C(C)(C)c1cc(OCCN(CC)CC)ccc1C3=O