Reaction Details
TargetALK tyrosine kinase receptor
LigandBDBM50344650
Substrate/Competitorn/a
Meas. Tech.ChEMBL_748985 (CHEMBL1781770)
IC50 3470±n/a nM
Citation Kinoshita, KOno, YEmura, TAsoh, KFuruichi, NIto, TKawada, HTanaka, SMorikami, KTsukaguchi, TSakamoto, HTsukuda, TOikawa, N Discovery of novel tetracyclic compounds as anaplastic lymphoma kinase inhibitors. Bioorg Med Chem Lett21:3788-93 (2011) 
 
ALK tyrosine kinase receptor
Name:ALK tyrosine kinase receptor
Type:Protein
Mol. Mass.:176453.10
Organism:Homo sapiens (Human)
Description:Q9UM73
Residue:1620
BDBM50344650
NameBDBM50344650
Synonyms:8-(2-(diethylamino)ethoxy)-6,6-dimethyl-3-(trifluoromethyl)benzo[d]naphtho[2,3-b]furan-11(6H)-one | CHEMBL1779188
TypeSmall organic molecule
Emp. Form.C25H26F3NO3
Mol. Mass.445.474
SMILESCCN(CC)CCOc1ccc2C(=O)c3c(oc4cc(ccc34)C(F)(F)F)C(C)(C)c2c1