Reaction Details
TargetALK tyrosine kinase receptor
LigandBDBM50344659
Substrate/Competitorn/a
Meas. Tech.ChEMBL_748985 (CHEMBL1781770)
IC50 18.5±n/a nM
Citation Kinoshita, KOno, YEmura, TAsoh, KFuruichi, NIto, TKawada, HTanaka, SMorikami, KTsukaguchi, TSakamoto, HTsukuda, TOikawa, N Discovery of novel tetracyclic compounds as anaplastic lymphoma kinase inhibitors. Bioorg Med Chem Lett21:3788-93 (2011) 
 
ALK tyrosine kinase receptor
Name:ALK tyrosine kinase receptor
Type:Protein
Mol. Mass.:176453.10
Organism:Homo sapiens (Human)
Description:Q9UM73
Residue:1620
BDBM50344659
NameBDBM50344659
Synonyms:6,6-dimethyl-8-morpholino-11-oxo-6,11-dihydro-5H-benzo[b]carbazole-3-carbonitrile | CHEMBL1779197
TypeSmall organic molecule
Emp. Form.C23H21N3O2
Mol. Mass.371.4317
SMILESCC1(C)c2[nH]c3cc(ccc3c2C(=O)c2ccc(cc12)N1CCOCC1)C#N