Reaction Details
TargetALK tyrosine kinase receptor
LigandBDBM50344663
Substrate/Competitorn/a
Meas. Tech.ChEMBL_748985 (CHEMBL1781770)
IC50 27±n/a nM
Citation Kinoshita, KOno, YEmura, TAsoh, KFuruichi, NIto, TKawada, HTanaka, SMorikami, KTsukaguchi, TSakamoto, HTsukuda, TOikawa, N Discovery of novel tetracyclic compounds as anaplastic lymphoma kinase inhibitors. Bioorg Med Chem Lett21:3788-93 (2011) 
 
ALK tyrosine kinase receptor
Name:ALK tyrosine kinase receptor
Type:Protein
Mol. Mass.:176453.10
Organism:Homo sapiens (Human)
Description:Q9UM73
Residue:1620
BDBM50344663
NameBDBM50344663
Synonyms:6,6-dimethyl-8-(4-(oxetan-3-yl)piperazin-1-yl)-11-oxo-6,11-dihydro-5H-benzo[b]carbazole-3-carbonitrile | CHEMBL1779201
TypeSmall organic molecule
Emp. Form.C26H26N4O2
Mol. Mass.426.5102
SMILESCC1(C)c2[nH]c3cc(ccc3c2C(=O)c2ccc(cc12)N1CCN(CC1)C1COC1)C#N