Reaction Details
TargetReceptor tyrosine-protein kinase erbB-2
LigandBDBM50344664
Substrate/Competitorn/a
Meas. Tech.ChEMBL_748991 (CHEMBL1781776)
IC50>50000±n/a nM
Citation Kinoshita, KOno, YEmura, TAsoh, KFuruichi, NIto, TKawada, HTanaka, SMorikami, KTsukaguchi, TSakamoto, HTsukuda, TOikawa, N Discovery of novel tetracyclic compounds as anaplastic lymphoma kinase inhibitors. Bioorg Med Chem Lett21:3788-93 (2011) 
 
Receptor tyrosine-protein kinase erbB-2
Name:Receptor tyrosine-protein kinase erbB-2
Type:n/a
Mol. Mass.:137894.47
Organism:Homo sapiens (Human)
Description:P04626
Residue:1255
BDBM50344664
NameBDBM50344664
Synonyms:6,6-dimethyl-8-(1-(oxetan-3-yl)piperidin-4-yl)-11-oxo-6,11-dihydro-5H-benzo[b]carbazole-3-carbonitrile US9126931, 178
TypeSmall organic molecule
Emp. Form.C27H27N3O2
Mol. Mass.425.5222
SMILESCC1(C)c2[nH]c3cc(ccc3c2C(=O)c2ccc(cc12)C1CCN(CC1)C1COC1)C#N