Reaction Details
TargetMAP kinase-activated protein kinase 2
LigandBDBM50344696
Substrate/Competitorn/a
Meas. Tech.ChEMBL_749048 (CHEMBL1780645)
EC50 4.3±n/a nM
Citation Kaptein, AOubrie, Ade Zwart, EHoogenboom, Nde Wit, Jvan de Kar, Bvan Hoek, MVogel, Gde Kimpe, VSchultz-Fademrecht, CBorsboom, Jvan Zeeland, MVersteegh, JKazemier, Bde Roos, JWijnands, FDulos, JJaeger, MLeandro-Garcia, PBarf, T Discovery of selective and orally available spiro-3-piperidyl ATP-competitive MK2 inhibitors. Bioorg Med Chem Lett21:3823-7 (2011) 
 
MAP kinase-activated protein kinase 2
Name:MAP kinase-activated protein kinase 2
Type:Serine/threonine-protein kinase
Mol. Mass.:45579.87
Organism:Homo sapiens (Human)
Description:P49137
Residue:400
BDBM50344696
NameBDBM50344696
Synonyms:2'-(2-(benzo[d][1,3]dioxol-5-yl)pyrimidin-4-yl)-5',6'-dihydrospiro[piperidine-4,7'-pyrrolo[3,2-c]pyridin]-4'(1'H)-one CHEMBL1738702
TypeSmall organic molecule
Emp. Form.C22H21N5O3
Mol. Mass.403.4338
SMILESO=C1NCC2(CCNCC2)c2[nH]c(cc12)-c1ccnc(n1)-c1ccc2OCOc2c1