Reaction Details
TargetATP-dependent translocase ABCB1
LigandBDBM50344754
Substrate/Competitorn/a
Meas. Tech.ChEMBL_749178 (CHEMBL1780906)
IC50>100000±n/a nM
Citation Puentes, COHöcherl, PKühnle, MBauer, SBürger, KBernhardt, GBuschauer, AKönig, B Solid phase synthesis of tariquidar-related modulators of ABC transporters preferring breast cancer resistance protein (ABCG2). Bioorg Med Chem Lett21:3654-7 (2011) 
 
ATP-dependent translocase ABCB1
Name:ATP-dependent translocase ABCB1
Type:Protein
Mol. Mass.:141503.50
Organism:Homo sapiens (Human)
Description:P08183
Residue:1280
BDBM50344754
NameBDBM50344754
Synonyms:CHEMBL1779525 | N-{4-[2-(7-Methoxy-6-{2-[2-(2-methoxy-ethoxy)-ethoxy]-ethoxy}-3,4-dihydro-1H-isoquinolin-2-yl)-ethyl]-phenyl}-2-[(quinoline-6-carbonyl)-amino]-terephthalamic acid methyl ester
TypeSmall organic molecule
Emp. Form.C44H48N4O9
Mol. Mass.776.8733
SMILESCOCCOCCOCCOc1cc2CCN(CCc3ccc(NC(=O)c4ccc(C(=O)OC)c(NC(=O)c5ccc6ncccc6c5)c4)cc3)Cc2cc1OC