Reaction Details
TargetBroad substrate specificity ATP-binding cassette transporter ABCG2
LigandBDBM50344759
Substrate/Competitorn/a
Meas. Tech.ChEMBL_749177 (CHEMBL1780905)
IC50>50000±n/a nM
Citation Puentes, COHöcherl, PKühnle, MBauer, SBürger, KBernhardt, GBuschauer, AKönig, B Solid phase synthesis of tariquidar-related modulators of ABC transporters preferring breast cancer resistance protein (ABCG2). Bioorg Med Chem Lett21:3654-7 (2011) 
 
Broad substrate specificity ATP-binding cassette transporter ABCG2
Name:Broad substrate specificity ATP-binding cassette transporter ABCG2
Type:Multi-pass membrane protein; monomer or homodimer; disulfide-linked
Mol. Mass.:72329.48
Organism:Homo sapiens (Human)
Description:Q9UNQ0
Residue:655
BDBM50344759
NameBDBM50344759
Synonyms:CHEMBL1779520 | N-{4-[2-(7-Methoxy-6-{2-[2-(2-methoxy-ethoxy)-ethoxy]-ethoxy}-3,4-dihydro-1H-isoquinolin-2-yl)-ethyl]-phenyl}-2-[(quinoline-2-carbonyl)-amino]-terephthalamic acid trifluoroacetic acid
TypeSmall organic molecule
Emp. Form.C43H46N4O9
Mol. Mass.762.8467
SMILESCOCCOCCOCCOc1cc2CCN(CCc3ccc(NC(=O)c4ccc(C(O)=O)c(NC(=O)c5ccc6ccccc6n5)c4)cc3)Cc2cc1OC