Reaction Details
TargetBroad substrate specificity ATP-binding cassette transporter ABCG2
LigandBDBM50344760
Substrate/Competitorn/a
Meas. Tech.ChEMBL_749177 (CHEMBL1780905)
IC50>100000±n/a nM
Citation Puentes, COHöcherl, PKühnle, MBauer, SBürger, KBernhardt, GBuschauer, AKönig, B Solid phase synthesis of tariquidar-related modulators of ABC transporters preferring breast cancer resistance protein (ABCG2). Bioorg Med Chem Lett21:3654-7 (2011) 
 
Broad substrate specificity ATP-binding cassette transporter ABCG2
Name:Broad substrate specificity ATP-binding cassette transporter ABCG2
Type:Multi-pass membrane protein; monomer or homodimer; disulfide-linked
Mol. Mass.:72329.48
Organism:Homo sapiens (Human)
Description:Q9UNQ0
Residue:655
BDBM50344760
NameBDBM50344760
Synonyms:CHEMBL1779519 | N-{4-[2-(6,7-Dimethoxy-3,4-dihydro-1H-isoquinolin-2-yl)-ethyl]-phenyl}-2-[(quinoline-6-carbonyl)-amino]-terephthalamic acid trifluoroacetic acid
TypeSmall organic molecule
Emp. Form.C37H34N4O6
Mol. Mass.630.6891
SMILESCOc1cc2CCN(CCc3ccc(NC(=O)c4ccc(C(O)=O)c(NC(=O)c5ccc6ncccc6c5)c4)cc3)Cc2cc1OC