Reaction Details
TargetSphingosine 1-phosphate receptor 4
LigandBDBM50344790
Substrate/Competitorn/a
Meas. Tech.ChEMBL_749238 (CHEMBL1781181)
IC50 931±n/a nM
Citation Guerrero, MUrbano, MVelaparthi, SZhao, JSchaeffer, MTBrown, SRosen, HRoberts, E Discovery, design and synthesis of the first reported potent and selective sphingosine-1-phosphate 4 (S1P4) receptor antagonists. Bioorg Med Chem Lett21:3632-6 (2011) 
 
Sphingosine 1-phosphate receptor 4
Name:Sphingosine 1-phosphate receptor 4
Type:G Protein-Coupled Receptor (GPCR)
Mol. Mass.:41647.39
Organism:Homo sapiens (Human)
Description:n/a
Residue:384
BDBM50344790
NameBDBM50344790
Synonyms:5-(2,5-dichlorophenyl)-N-(5-methoxy-2-methylphenyl)furan-2-carboxamide | CHEMBL1779897
TypeSmall organic molecule
Emp. Form.C19H15Cl2NO3
Mol. Mass.376.233
SMILESCOc1ccc(C)c(NC(=O)c2ccc(o2)-c2cc(Cl)ccc2Cl)c1