Reaction Details
TargetSphingosine 1-phosphate receptor 4
LigandBDBM50344811
Substrate/Competitorn/a
Meas. Tech.ChEMBL_749238 (CHEMBL1781181)
IC50 93±n/a nM
Citation Guerrero, MUrbano, MVelaparthi, SZhao, JSchaeffer, MTBrown, SRosen, HRoberts, E Discovery, design and synthesis of the first reported potent and selective sphingosine-1-phosphate 4 (S1P4) receptor antagonists. Bioorg Med Chem Lett21:3632-6 (2011) 
 
Sphingosine 1-phosphate receptor 4
Name:Sphingosine 1-phosphate receptor 4
Type:G Protein-Coupled Receptor (GPCR)
Mol. Mass.:41647.39
Organism:Homo sapiens (Human)
Description:n/a
Residue:384
BDBM50344811
NameBDBM50344811
Synonyms:CHEMBL1779916 | N-(2,6-dimethylphenyl)-5-(3-methylthiophen-2-yl)furan-2-carboxamide
TypeSmall organic molecule
Emp. Form.C18H17NO2S
Mol. Mass.311.398
SMILESCc1ccsc1-c1ccc(o1)C(=O)Nc1c(C)cccc1C