Reaction Details
TargetSphingosine 1-phosphate receptor 2
LigandBDBM50344793
Substrate/Competitorn/a
Meas. Tech.ChEMBL_749242 (CHEMBL1781185)
IC50 2800±n/a nM
Citation Guerrero, MUrbano, MVelaparthi, SZhao, JSchaeffer, MTBrown, SRosen, HRoberts, E Discovery, design and synthesis of the first reported potent and selective sphingosine-1-phosphate 4 (S1P4) receptor antagonists. Bioorg Med Chem Lett21:3632-6 (2011) 
 
Sphingosine 1-phosphate receptor 2
Name:Sphingosine 1-phosphate receptor 2
Type:G Protein-Coupled Receptor (GPCR)
Mol. Mass.:38883.16
Organism:Homo sapiens (Human)
Description:Membranes isolated from S1P2-transfected CHO cells were used in ligand binding assay.
Residue:353
BDBM50344793
NameBDBM50344793
Synonyms:5-(2,5-dichlorophenyl)-N-(4-methoxy-2,6-dimethylphenyl)furan-2-carboxamide | CHEMBL1779894
TypeSmall organic molecule
Emp. Form.C20H17Cl2NO3
Mol. Mass.390.26
SMILESCOc1cc(C)c(NC(=O)c2ccc(o2)-c2cc(Cl)ccc2Cl)c(C)c1