Reaction Details
TargetSphingosine 1-phosphate receptor 2
LigandBDBM50344811
Substrate/Competitorn/a
Meas. Tech.ChEMBL_749242 (CHEMBL1781185)
IC50 2600±n/a nM
Citation Guerrero, MUrbano, MVelaparthi, SZhao, JSchaeffer, MTBrown, SRosen, HRoberts, E Discovery, design and synthesis of the first reported potent and selective sphingosine-1-phosphate 4 (S1P4) receptor antagonists. Bioorg Med Chem Lett21:3632-6 (2011) 
 
Sphingosine 1-phosphate receptor 2
Name:Sphingosine 1-phosphate receptor 2
Type:G Protein-Coupled Receptor (GPCR)
Mol. Mass.:38883.16
Organism:Homo sapiens (Human)
Description:Membranes isolated from S1P2-transfected CHO cells were used in ligand binding assay.
Residue:353
BDBM50344811
NameBDBM50344811
Synonyms:CHEMBL1779916 | N-(2,6-dimethylphenyl)-5-(3-methylthiophen-2-yl)furan-2-carboxamide
TypeSmall organic molecule
Emp. Form.C18H17NO2S
Mol. Mass.311.398
SMILESCc1ccsc1-c1ccc(o1)C(=O)Nc1c(C)cccc1C