Reaction Details
TargetP2X purinoceptor 7
LigandBDBM50344904
Substrate/Competitorn/a
Meas. Tech.ChEMBL_748931 (CHEMBL1781379)
IC50 51±n/a nM
Citation Matasi, JJBrumfield, STulshian, DCzarnecki, MGreenlee, WGarlisi, CGQiu, HDevito, KChen, SCSun, YBertorelli, RGeiss, WLe, VDMartin, GSVellekoop, SAHaber, JAllard, ML Synthesis and SAR development of novel P2X7 receptor antagonists for the treatment of pain: part 1. Bioorg Med Chem Lett21:3805-8 (2011) 
 
P2X purinoceptor 7
Name:P2X purinoceptor 7
Type:Protein
Mol. Mass.:68602.85
Organism:Homo sapiens (Human)
Description:Q99572
Residue:595
BDBM50344904
NameBDBM50344904
Synonyms:(R)-1-(3,4-difluorobenzyl)-2-(6-(4,4-difluoropiperidine-1-carbonyl)pyridin-3-yl)-5-ethyl-7-isopropyl-7,8-dihydro-1H-imidazo[2,1-b]purin-4(5H)-one | CHEMBL1778031
TypeSmall organic molecule
Emp. Form.C30H31F4N7O2
Mol. Mass.597.6065
SMILESCCN1C2=N[C@@H](CN2c2c(nc(-c3ccc(nc3)C(=O)N3CCC(F)(F)CC3)n2Cc2ccc(F)c(F)c2)C1=O)C(C)C