Reaction Details
TargetDual 3',5'-cyclic-AMP and -GMP phosphodiesterase 11A
LigandBDBM50344902
Substrate/Competitorn/a
Meas. Tech.ChEMBL_748941 (CHEMBL1781389)
IC50 140±n/a nM
Citation Matasi, JJBrumfield, STulshian, DCzarnecki, MGreenlee, WGarlisi, CGQiu, HDevito, KChen, SCSun, YBertorelli, RGeiss, WLe, VDMartin, GSVellekoop, SAHaber, JAllard, ML Synthesis and SAR development of novel P2X7 receptor antagonists for the treatment of pain: part 1. Bioorg Med Chem Lett21:3805-8 (2011) 
 
Dual 3',5'-cyclic-AMP and -GMP phosphodiesterase 11A
Name:Dual 3',5'-cyclic-AMP and -GMP phosphodiesterase 11A
Type:Enzyme
Mol. Mass.:104751.53
Organism:Homo sapiens (Human)
Description:Q9HCR9
Residue:933
BDBM50344902
NameBDBM50344902
Synonyms:1,2-dibenzyl-5-ethyl-2',3',5,8-tetrahydrospiro[imidazo[2,1-b]purine-7,1'-inden]-4(1H)-one | CHEMBL1778033
TypeSmall organic molecule
Emp. Form.C31H29N5O
Mol. Mass.487.5949
SMILESCCN1C2=NC3(CCc4ccccc34)CN2c2c(nc(Cc3ccccc3)n2Cc2ccccc2)C1=O