Reaction Details
TargetProstaglandin D2 receptor 2
LigandBDBM50344991
Substrate/Competitorn/a
Meas. Tech.ChEMBL_749090 (CHEMBL1780687)
IC50 0.900000±n/a nM
Citation Luker, TBonnert, RSchmidt, JSargent, CPaine, SWThom, SPairaudeau, GPatel, AMohammed, RAkam, EDougall, IDavis, AMAbbott, PBrough, SMillichip, IMcInally, T Switching between agonists and antagonists at CRTh2 in a series of highly potent and selective biaryl phenoxyacetic acids. Bioorg Med Chem Lett21:3616-21 (2011) 
 
Prostaglandin D2 receptor 2
Name:Prostaglandin D2 receptor 2
Type:Enzyme
Mol. Mass.:43295.45
Organism:Homo sapiens (Human)
Description:Q9Y5Y4
Residue:395
BDBM50344991
NameBDBM50344991
Synonyms:2-(4'-(ethylsulfonyl)-2'-methyl-5-(trifluoromethyl)biphenyl-2-yloxy)acetic acid | CHEMBL1778639
TypeSmall organic molecule
Emp. Form.C18H17F3O5S
Mol. Mass.402.385
SMILESCCS(=O)(=O)c1ccc(c(C)c1)-c1cc(ccc1OCC(O)=O)C(F)(F)F