Reaction Details
TargetProstaglandin D2 receptor 2
LigandBDBM50344988
Substrate/Competitorn/a
Meas. Tech.ChEMBL_749090 (CHEMBL1780687)
IC50 0.600000±n/a nM
Citation Luker, TBonnert, RSchmidt, JSargent, CPaine, SWThom, SPairaudeau, GPatel, AMohammed, RAkam, EDougall, IDavis, AMAbbott, PBrough, SMillichip, IMcInally, T Switching between agonists and antagonists at CRTh2 in a series of highly potent and selective biaryl phenoxyacetic acids. Bioorg Med Chem Lett21:3616-21 (2011) 
 
Prostaglandin D2 receptor 2
Name:Prostaglandin D2 receptor 2
Type:Enzyme
Mol. Mass.:43295.45
Organism:Homo sapiens (Human)
Description:Q9Y5Y4
Residue:395
BDBM50344988
NameBDBM50344988
Synonyms:2-(2',5-dichloro-4'-(methylsulfonyl)biphenyl-2-yloxy)acetic acid | CHEMBL1778642
TypeSmall organic molecule
Emp. Form.C15H12Cl2O5S
Mol. Mass.375.224
SMILESCS(=O)(=O)c1ccc(c(Cl)c1)-c1cc(Cl)ccc1OCC(O)=O