Reaction Details
TargetProtein kinase C alpha type
LigandBDBM50345029
Substrate/Competitorn/a
Meas. Tech.ChEMBL_749161 (CHEMBL1780758)
Ki>20000±n/a nM
Citation Hirai, GOhkubo, MTamura, YSodeoka, M Design and synthesis of protein kinase Ca activators based on 'out of pocket' interactions. Bioorg Med Chem Lett21:3587-90 (2011) 
 
Protein kinase C alpha type
Name:Protein kinase C alpha type
Type:Enzyme
Mol. Mass.:76755.65
Organism:Homo sapiens (Human)
Description:The recombinant human PKC enzymes were produced using a baculovirus expression system in SF9 cells
Residue:672
BDBM50345029
NameBDBM50345029
Synonyms:((R)-1-(hydroxymethyl)-3-oxo-4-(3-((2R,3S,5R,6S)-2,3,5,6-tetrakis(benzyloxy)-4-(dodecyloxy)cyclohexyloxy)prop-1-ynyl)-1,3-dihydroisobenzofuran-1-yl)methyl 2-tert-butyl-3,3-dimethylbutanoate | CHEMBL1778824
TypeSmall organic molecule
Emp. Form.C69H88O11
Mol. Mass.1093.4304
SMILESCCCCCCCCCCCCO[C@@H]1[C@H](OCc2ccccc2)[C@@H](OCc2ccccc2)[C@H](OCC#Cc2cccc3c2C(=O)O[C@]3(CO)COC(=O)C(C(C)(C)C)C(C)(C)C)[C@@H](OCc2ccccc2)[C@@H]1OCc1ccccc1