Reaction Details
TargetProtein kinase C alpha type
LigandBDBM50345027
Substrate/Competitorn/a
Meas. Tech.ChEMBL_749161 (CHEMBL1780758)
Ki 600±n/a nM
Citation Hirai, GOhkubo, MTamura, YSodeoka, M Design and synthesis of protein kinase Ca activators based on 'out of pocket' interactions. Bioorg Med Chem Lett21:3587-90 (2011) 
 
Protein kinase C alpha type
Name:Protein kinase C alpha type
Type:Enzyme
Mol. Mass.:76755.65
Organism:Homo sapiens (Human)
Description:The recombinant human PKC enzymes were produced using a baculovirus expression system in SF9 cells
Residue:672
BDBM50345027
NameBDBM50345027
Synonyms:((R)-4-(3-((2R,3R,5S,6S)-4-(dodecyloxy)-2,3,5,6-tetramethoxycyclohexyloxy)prop-1-ynyl)-1-(hydroxymethyl)-3-oxo-1,3-dihydroisobenzofuran-1-yl)methyl 2-tert-butyl-3,3-dimethylbutanoate | CHEMBL1778822
TypeSmall organic molecule
Emp. Form.C45H72O11
Mol. Mass.789.0466
SMILESCCCCCCCCCCCCO[C@H]1[C@@H](OC)[C@H](OC)[C@@H](OCC#Cc2cccc3c2C(=O)O[C@]3(CO)COC(=O)C(C(C)(C)C)C(C)(C)C)[C@H](OC)[C@H]1OC