Reaction Details
TargetVasopressin V1b receptor
LigandBDBM50345144
Substrate/Competitorn/a
Meas. Tech.ChEMBL_748738 (CHEMBL1780591)
Ki 3.8±n/a nM
Citation Oost, TBackfisch, GBhowmik, Svan Gaalen, MMGeneste, HHornberger, WLubisch, WNetz, AUnger, LWernet, W Potent and selective oxindole-based vasopressin 1b receptor antagonists with improved pharmacokinetic properties. Bioorg Med Chem Lett21:3828-31 (2011) 
 
Vasopressin V1b receptor
Name:Vasopressin V1b receptor
Type:Enzyme
Mol. Mass.:46985.01
Organism:Homo sapiens (Human)
Description:P47901
Residue:424
BDBM50345144
NameBDBM50345144
Synonyms:(S)-1-((R)-5-chloro-1-(2,4-dimethoxyphenylsulfonyl)-3-(2-methoxypyridin-3-yl)-2-oxoindolin-3-yl)-N,N-dimethylpyrrolidine-2-carboxamide | CHEMBL1779401
TypeSmall organic molecule
Emp. Form.C29H31ClN4O7S
Mol. Mass.615.097
SMILESCOc1ccc(c(OC)c1)S(=O)(=O)N1C(=O)[C@@](N2CCC[C@H]2C(=O)N(C)C)(c2cc(Cl)ccc12)c1cccnc1OC